Target
Muscarinic acetylcholine receptor M1
Ligand
BDBM50601567
Substrate
Meas. Tech.
ChEMBL_2237593 (CHEMBL5151489)
Kd
0.170000±n/a nM
Citation
 Tropmann, KBresinsky, MForster, LMönnich, DBuschauer, AWittmann, HJHübner, HGmeiner, PPockes, SStrasser, A Abolishing Dopamine D J Med Chem 64:8684-8709 (2021) Target
Name:
Muscarinic acetylcholine receptor M1
Synonyms:
ACM1_HUMAN Cholinergic receptor, muscarinic 1 | Cholinergic, muscarinic M1
Type:
Protein
Mol. Mass.:
51442.54
Organism:
Homo sapiens (Human)
Description:
P11229
Residue:
460
  
Inhibitor
Name:
BDBM50601567
Synonyms:
CHEMBL5206565
Type:
Small organic molecule
Emp. Form.:
C18H21F6N7O5S
Mol. Mass.:
561.459
SMILES:
OC(=O)C(F)(F)F.OC(=O)C(F)(F)F.N\C(NCCCc1nnc(N)s1)=N/C(=O)NCc1ccccc1
: