Target
Peroxisome proliferator-activated receptor gamma
Ligand
BDBM50181903
Substrate
Meas. Tech.
ChEMBL_333345 (CHEMBL858178)
IC50
129±n/a nM
Citation
 Mahindroo, NWang, CCLiao, CCHuang, CFLu, ILLien, TWPeng, YHHuang, WJLin, YTHsu, MCLin, CHTsai, CHHsu, JTChen, XLyu, PCChao, YSWu, SYHsieh, HP Indol-1-yl acetic acids as peroxisome proliferator-activated receptor agonists: design, synthesis, structural biology, and molecular docking studies. J Med Chem 49:1212-6 (2006)  
Target
Name:
Peroxisome proliferator-activated receptor gamma
Synonyms:
NR1C3 PPAR-gamma PPARG_HUMAN Peroxisome proliferator-activated receptor gamma (PPAR gamma) Peroxisome proliferator-activated receptor gamma (PPARĪ³) peroxisome proliferator-activated receptor gamma isoform 2
Type:
Nuclear Receptor
Mol. Mass.:
57613.46
Organism:
Homo sapiens (Human)
Description:
P37231
Residue:
505
  
Inhibitor
Name:
BDBM50181903
Synonyms:
2-(5-(3-(4-(4-fluorobenzoyl)-2-propylphenoxy)propoxy)-1H-indol-1-yl)acetic acid | CHEMBL425766
Type:
Small organic molecule
Emp. Form.:
C29H28FNO5
Mol. Mass.:
489.5347
SMILES:
CCCc1cc(ccc1OCCCOc1ccc2n(CC(O)=O)ccc2c1)C(=O)c1ccc(F)cc1
: