Target
Peroxisome proliferator-activated receptor delta
Ligand
BDBM50181905
Substrate
Meas. Tech.
ChEMBL_333346 (CHEMBL858179)
IC50
5377±n/a nM
Citation
 Mahindroo, NWang, CCLiao, CCHuang, CFLu, ILLien, TWPeng, YHHuang, WJLin, YTHsu, MCLin, CHTsai, CHHsu, JTChen, XLyu, PCChao, YSWu, SYHsieh, HP Indol-1-yl acetic acids as peroxisome proliferator-activated receptor agonists: design, synthesis, structural biology, and molecular docking studies. J Med Chem 49:1212-6 (2006)  
Target
Name:
Peroxisome proliferator-activated receptor delta
Synonyms:
NR1C2 NUCI Nuclear receptor subfamily 1 group C member 2 PPAR-beta PPARD Peroxisome proliferator-activated receptor Peroxisome proliferator-activated receptor delta
Type:
Enzyme
Mol. Mass.:
49910.45
Organism:
Homo sapiens (Human)
Description:
Q03181
Residue:
441
  
Inhibitor
Name:
BDBM50181905
Synonyms:
2-(4-(3-(6-benzoyl-1-propylnaphthalen-2-yloxy)propoxy)-1H-indol-1-yl)acetic acid | CHEMBL201036
Type:
Small organic molecule
Emp. Form.:
C33H31NO5
Mol. Mass.:
521.6029
SMILES:
CCCc1c(OCCCOc2cccc3n(CC(O)=O)ccc23)ccc2cc(ccc12)C(=O)c1ccccc1
: