Target
Peroxisome proliferator-activated receptor alpha
Ligand
BDBM50181912
Substrate
Meas. Tech.
ChEMBL_333344 (CHEMBL859134)
IC50
4486±n/a nM
Citation
 Mahindroo, NWang, CCLiao, CCHuang, CFLu, ILLien, TWPeng, YHHuang, WJLin, YTHsu, MCLin, CHTsai, CHHsu, JTChen, XLyu, PCChao, YSWu, SYHsieh, HP Indol-1-yl acetic acids as peroxisome proliferator-activated receptor agonists: design, synthesis, structural biology, and molecular docking studies. J Med Chem 49:1212-6 (2006)  
Target
Name:
Peroxisome proliferator-activated receptor alpha
Synonyms:
NR1C1 PPAR PPAR-alpha PPARA_HUMAN Peroxisome proliferator-activated receptor | Peroxisome proliferator-activated receptor alpha (PPAR alpha)
Type:
Enzyme
Mol. Mass.:
52222.08
Organism:
Homo sapiens (Human)
Description:
Q07869
Residue:
468
  
Inhibitor
Name:
BDBM50181912
Synonyms:
2-(6-(3-(6-benzoylnaphthalen-2-yloxy)propoxy)-1H-indol-1-yl)acetic acid | CHEMBL202515
Type:
Small organic molecule
Emp. Form.:
C30H25NO5
Mol. Mass.:
479.5232
SMILES:
OC(=O)Cn1ccc2ccc(OCCCOc3ccc4cc(ccc4c3)C(=O)c3ccccc3)cc12
: