Target
Peroxisome proliferator-activated receptor delta
Ligand
BDBM50181906
Substrate
Meas. Tech.
ChEMBL_333346 (CHEMBL858179)
IC50
>10000±n/a nM
Citation
 Mahindroo, NWang, CCLiao, CCHuang, CFLu, ILLien, TWPeng, YHHuang, WJLin, YTHsu, MCLin, CHTsai, CHHsu, JTChen, XLyu, PCChao, YSWu, SYHsieh, HP Indol-1-yl acetic acids as peroxisome proliferator-activated receptor agonists: design, synthesis, structural biology, and molecular docking studies. J Med Chem 49:1212-6 (2006)  
Target
Name:
Peroxisome proliferator-activated receptor delta
Synonyms:
NR1C2 NUCI Nuclear receptor subfamily 1 group C member 2 PPAR-beta PPARD Peroxisome proliferator-activated receptor Peroxisome proliferator-activated receptor delta
Type:
Enzyme
Mol. Mass.:
49910.45
Organism:
Homo sapiens (Human)
Description:
Q03181
Residue:
441
  
Inhibitor
Name:
BDBM50181906
Synonyms:
2-(4-(3-(6-benzoylnaphthalen-2-yloxy)propoxy)-1H-indol-1-yl)acetic acid | CHEMBL383132
Type:
Small organic molecule
Emp. Form.:
C30H25NO5
Mol. Mass.:
479.5232
SMILES:
OC(=O)Cn1ccc2c(OCCCOc3ccc4cc(ccc4c3)C(=O)c3ccccc3)cccc12
: