Target
Peroxisome proliferator-activated receptor gamma
Ligand
BDBM50181904
Substrate
Meas. Tech.
ChEMBL_333345 (CHEMBL858178)
IC50
629±n/a nM
Citation
 Mahindroo, NWang, CCLiao, CCHuang, CFLu, ILLien, TWPeng, YHHuang, WJLin, YTHsu, MCLin, CHTsai, CHHsu, JTChen, XLyu, PCChao, YSWu, SYHsieh, HP Indol-1-yl acetic acids as peroxisome proliferator-activated receptor agonists: design, synthesis, structural biology, and molecular docking studies. J Med Chem 49:1212-6 (2006)  
Target
Name:
Peroxisome proliferator-activated receptor gamma
Synonyms:
NR1C3 PPAR-gamma PPARG_HUMAN Peroxisome proliferator-activated receptor gamma (PPAR gamma) Peroxisome proliferator-activated receptor gamma (PPARĪ³) peroxisome proliferator-activated receptor gamma isoform 2
Type:
Nuclear Receptor
Mol. Mass.:
57613.46
Organism:
Homo sapiens (Human)
Description:
P37231
Residue:
505
  
Inhibitor
Name:
BDBM50181904
Synonyms:
2-(5-(3-(6-benzoylnaphthalen-2-yloxy)propoxy)-1H-indol-1-yl)acetic acid | CHEMBL202617
Type:
Small organic molecule
Emp. Form.:
C30H25NO5
Mol. Mass.:
479.5232
SMILES:
OC(=O)Cn1ccc2cc(OCCCOc3ccc4cc(ccc4c3)C(=O)c3ccccc3)ccc12
: