Target
Peroxisome proliferator-activated receptor alpha
Ligand
BDBM50181907
Substrate
Meas. Tech.
ChEMBL_333344 (CHEMBL859134)
IC50
414±n/a nM
Citation
 Mahindroo, NWang, CCLiao, CCHuang, CFLu, ILLien, TWPeng, YHHuang, WJLin, YTHsu, MCLin, CHTsai, CHHsu, JTChen, XLyu, PCChao, YSWu, SYHsieh, HP Indol-1-yl acetic acids as peroxisome proliferator-activated receptor agonists: design, synthesis, structural biology, and molecular docking studies. J Med Chem 49:1212-6 (2006)  
Target
Name:
Peroxisome proliferator-activated receptor alpha
Synonyms:
NR1C1 PPAR PPAR-alpha PPARA_HUMAN Peroxisome proliferator-activated receptor | Peroxisome proliferator-activated receptor alpha (PPAR alpha)
Type:
Enzyme
Mol. Mass.:
52222.08
Organism:
Homo sapiens (Human)
Description:
Q07869
Residue:
468
  
Inhibitor
Name:
BDBM50181907
Synonyms:
2-(4-(3-(4-(4-fluorobenzoyl)-2-propylphenoxy)propoxy)-1H-indol-1-yl)acetic acid | CHEMBL201653
Type:
Small organic molecule
Emp. Form.:
C29H28FNO5
Mol. Mass.:
489.5347
SMILES:
CCCc1cc(ccc1OCCCOc1cccc2n(CC(O)=O)ccc12)C(=O)c1ccc(F)cc1
: