Target
Peroxisome proliferator-activated receptor delta
Ligand
BDBM50181907
Substrate
Meas. Tech.
ChEMBL_333346 (CHEMBL858179)
IC50
3256±n/a nM
Citation
 Mahindroo, NWang, CCLiao, CCHuang, CFLu, ILLien, TWPeng, YHHuang, WJLin, YTHsu, MCLin, CHTsai, CHHsu, JTChen, XLyu, PCChao, YSWu, SYHsieh, HP Indol-1-yl acetic acids as peroxisome proliferator-activated receptor agonists: design, synthesis, structural biology, and molecular docking studies. J Med Chem 49:1212-6 (2006)  
Target
Name:
Peroxisome proliferator-activated receptor delta
Synonyms:
NR1C2 NUCI Nuclear receptor subfamily 1 group C member 2 PPAR-beta PPARD Peroxisome proliferator-activated receptor Peroxisome proliferator-activated receptor delta
Type:
Enzyme
Mol. Mass.:
49910.45
Organism:
Homo sapiens (Human)
Description:
Q03181
Residue:
441
  
Inhibitor
Name:
BDBM50181907
Synonyms:
2-(4-(3-(4-(4-fluorobenzoyl)-2-propylphenoxy)propoxy)-1H-indol-1-yl)acetic acid | CHEMBL201653
Type:
Small organic molecule
Emp. Form.:
C29H28FNO5
Mol. Mass.:
489.5347
SMILES:
CCCc1cc(ccc1OCCCOc1cccc2n(CC(O)=O)ccc12)C(=O)c1ccc(F)cc1
: