Target
Peroxisome proliferator-activated receptor alpha
Ligand
BDBM50181909
Substrate
Meas. Tech.
ChEMBL_333344 (CHEMBL859134)
IC50
4486±n/a nM
Citation
 Mahindroo, NWang, CCLiao, CCHuang, CFLu, ILLien, TWPeng, YHHuang, WJLin, YTHsu, MCLin, CHTsai, CHHsu, JTChen, XLyu, PCChao, YSWu, SYHsieh, HP Indol-1-yl acetic acids as peroxisome proliferator-activated receptor agonists: design, synthesis, structural biology, and molecular docking studies. J Med Chem 49:1212-6 (2006)  
Target
Name:
Peroxisome proliferator-activated receptor alpha
Synonyms:
NR1C1 PPAR PPAR-alpha PPARA_HUMAN Peroxisome proliferator-activated receptor | Peroxisome proliferator-activated receptor alpha (PPAR alpha)
Type:
Enzyme
Mol. Mass.:
52222.08
Organism:
Homo sapiens (Human)
Description:
Q07869
Residue:
468
  
Inhibitor
Name:
BDBM50181909
Synonyms:
2-(6-(3-(6-benzoyl-1-propylnaphthalen-2-yloxy)propoxy)-1H-indol-1-yl)acetic acid | CHEMBL202246
Type:
Small organic molecule
Emp. Form.:
C33H31NO5
Mol. Mass.:
521.6029
SMILES:
CCCc1c(OCCCOc2ccc3ccn(CC(O)=O)c3c2)ccc2cc(ccc12)C(=O)c1ccccc1
: