Target
Peroxisome proliferator-activated receptor gamma
Ligand
BDBM50181902
Substrate
Meas. Tech.
ChEMBL_333345 (CHEMBL858178)
IC50
2072±n/a nM
Citation
 Mahindroo, NWang, CCLiao, CCHuang, CFLu, ILLien, TWPeng, YHHuang, WJLin, YTHsu, MCLin, CHTsai, CHHsu, JTChen, XLyu, PCChao, YSWu, SYHsieh, HP Indol-1-yl acetic acids as peroxisome proliferator-activated receptor agonists: design, synthesis, structural biology, and molecular docking studies. J Med Chem 49:1212-6 (2006)  
Target
Name:
Peroxisome proliferator-activated receptor gamma
Synonyms:
NR1C3 PPAR-gamma PPARG_HUMAN Peroxisome proliferator-activated receptor gamma (PPAR gamma) Peroxisome proliferator-activated receptor gamma (PPARĪ³) peroxisome proliferator-activated receptor gamma isoform 2
Type:
Nuclear Receptor
Mol. Mass.:
57613.46
Organism:
Homo sapiens (Human)
Description:
P37231
Residue:
505
  
Inhibitor
Name:
BDBM50181902
Synonyms:
2-(6-(3-(4-(4-fluorobenzoyl)phenoxy)propoxy)-1H-indol-1-yl)acetic acid | CHEMBL201581
Type:
Small organic molecule
Emp. Form.:
C26H22FNO5
Mol. Mass.:
447.455
SMILES:
OC(=O)Cn1ccc2ccc(OCCCOc3ccc(cc3)C(=O)c3ccc(F)cc3)cc12
: