Target
Peroxisome proliferator-activated receptor gamma
Ligand
BDBM50181909
Substrate
Meas. Tech.
ChEMBL_333345 (CHEMBL858178)
IC50
2024±n/a nM
Citation
 Mahindroo, NWang, CCLiao, CCHuang, CFLu, ILLien, TWPeng, YHHuang, WJLin, YTHsu, MCLin, CHTsai, CHHsu, JTChen, XLyu, PCChao, YSWu, SYHsieh, HP Indol-1-yl acetic acids as peroxisome proliferator-activated receptor agonists: design, synthesis, structural biology, and molecular docking studies. J Med Chem 49:1212-6 (2006)  
Target
Name:
Peroxisome proliferator-activated receptor gamma
Synonyms:
NR1C3 PPAR-gamma PPARG_HUMAN Peroxisome proliferator-activated receptor gamma (PPAR gamma) Peroxisome proliferator-activated receptor gamma (PPARĪ³) peroxisome proliferator-activated receptor gamma isoform 2
Type:
Nuclear Receptor
Mol. Mass.:
57613.46
Organism:
Homo sapiens (Human)
Description:
P37231
Residue:
505
  
Inhibitor
Name:
BDBM50181909
Synonyms:
2-(6-(3-(6-benzoyl-1-propylnaphthalen-2-yloxy)propoxy)-1H-indol-1-yl)acetic acid | CHEMBL202246
Type:
Small organic molecule
Emp. Form.:
C33H31NO5
Mol. Mass.:
521.6029
SMILES:
CCCc1c(OCCCOc2ccc3ccn(CC(O)=O)c3c2)ccc2cc(ccc12)C(=O)c1ccccc1
: