Target
Histone-lysine N-methyltransferase 2A
Ligand
BDBM50601694
Substrate
Meas. Tech.
ChEMBL_2237957 (CHEMBL5151853)
IC50
20±n/a nM
Citation
 Chen, XXu, JWang, XLong, GYou, QGuo, X Targeting WD Repeat-Containing Protein 5 (WDR5): A Medicinal Chemistry Perspective. J Med Chem 64:10537-10556 (2021) Target
Name:
Histone-lysine N-methyltransferase 2A
Synonyms:
ALL-1 ALL1 CXXC-type zinc finger protein 7 HRX Histone-lysine N-methyltransferase 2A KMT2A_HUMAN MLL MLL cleavage product N320 Myeloid/lymphoid or mixed-lineage leukemia Myeloid/lymphoid or mixed-lineage leukemia protein 1 TRX1 Zinc finger protein HRX p320
Type:
Protein
Mol. Mass.:
431905.67
Organism:
Homo sapiens (Human)
Description:
Q03164
Residue:
3969
  
Inhibitor
Name:
BDBM50601694
Synonyms:
CHEMBL5183439
Type:
Small organic molecule
Emp. Form.:
C25H22Cl2N4O2
Mol. Mass.:
481.374
SMILES:
Cc1ncccc1-c1cc(Cn2ccn(C)c2=O)cc(c1)C(=O)NCc1cc(Cl)cc(Cl)c1
: