Target
Adenosine deaminase
Ligand
BDBM50367032
Substrate
Meas. Tech.
ChEMBL_2238227 (CHEMBL5152123)
Ki
0.010±n/a nM
Citation
 Hou, RHe, YYan, GHou, SXie, ZLiao, C Zinc enzymes in medicinal chemistry. Eur J Med Chem 226:0 (2021) Target
Name:
Adenosine deaminase
Synonyms:
ADA ADA_HUMAN | Adenosine aminohydrolase
Type:
Enzyme
Mol. Mass.:
40759.44
Organism:
Homo sapiens (Human)
Description:
Human recombinant ADA was expressed and purified from an ADA-deficient bacterial strain.
Residue:
363
  
Inhibitor
Name:
BDBM50367032
Synonyms:
COFORMYCIN
Type:
Small organic molecule
Emp. Form.:
C11H16N4O5
Mol. Mass.:
284.2685
SMILES:
OC[C@H]1O[C@H]([C@H](O)[C@@H]1O)n1cnc2[C@H](O)CNC=Nc12
: