Target
Amine oxidase [flavin-containing] B
Ligand
BDBM50601855
Substrate
Meas. Tech.
ChEMBL_2238398 (CHEMBL5152294)
Ki
2.9±n/a nM
Citation
 Chen, ZHaider, AChen, JXiao, ZGobbi, LHoner, MGrether, UArnold, SEJosephson, LLiang, SH The Repertoire of Small-Molecule PET Probes for Neuroinflammation Imaging: Challenges and Opportunities beyond TSPO. J Med Chem 64:17656-17689 (2021) Target
Name:
Amine oxidase [flavin-containing] B
Synonyms:
AOFB_HUMAN MAOB Monoamine oxidase type B (MAO B) Monoamine oxidase type B (MAOB)
Type:
Protein
Mol. Mass.:
58768.76
Organism:
Homo sapiens (Human)
Description:
P27338
Residue:
520
  
Inhibitor
Name:
BDBM50601855
Synonyms:
CHEMBL5189391
Type:
Small organic molecule
Emp. Form.:
C16H17F3N2O5
Mol. Mass.:
373.3125
SMILES:
COCC1CN(c2noc3cc(OCCCC(F)(F)F)ccc23)[11C](=O)O1
: