Target
Melanocortin receptor 4
Ligand
BDBM50182069
Substrate
Meas. Tech.
ChEMBL_348051 (CHEMBL868466)
Ki
700±n/a nM
Citation
 Vos, TJBalani, SBlackburn, CChau, RWDanca, MDDrabic, SVFarrer, CAPatane, MAStroud, SGYowe, DLClaiborne, CF Identification and structure-activity relationships of a new series of Melanocortin-4 receptor antagonists. Bioorg Med Chem Lett 16:2302-5 (2006)  
Target
Name:
Melanocortin receptor 4
Synonyms:
MC4-R MC4R_HUMAN Melanocortin receptor 4 (MC-4) Melanocortin receptor 4 (MC4R)
Type:
Enzyme
Mol. Mass.:
36949.50
Organism:
Homo sapiens (Human)
Description:
P32245
Residue:
332
  
Inhibitor
Name:
BDBM50182069
Synonyms:
CHEMBL413931 | N-{2-[2-(5-bromo-2-methoxy-phenyl)-ethyl]-3-chloro-benzoyl}-guanidine
Type:
Small organic molecule
Emp. Form.:
C17H17BrClN3O2
Mol. Mass.:
410.693
SMILES:
COc1ccc(Br)cc1CCc1c(Cl)cccc1C(=O)NC(N)=N
: