Target
Subtilisin-like protease 1
Ligand
BDBM50601897
Substrate
Meas. Tech.
ChEMBL_2238563 (CHEMBL5152459)
IC50
6000±n/a nM
Citation
 Lidumniece, EWithers-Martinez, CHackett, FBlackman, MJJirgensons, A Subtilisin-like Serine Protease 1 (SUB1) as an Emerging Antimalarial Drug Target: Current Achievements in Inhibitor Discovery. J Med Chem 65:12535-12545 (2022) Target
Name:
Subtilisin-like protease 1
Synonyms:
SUB1 Subtilisin-like protease sub-1
Type:
PROTEIN
Mol. Mass.:
77866.88
Organism:
Plasmodium falciparum
Description:
ChEMBL_830092
Residue:
690
  
Inhibitor
Name:
BDBM50601897
Synonyms:
CHEMBL5205624
Type:
Small organic molecule
Emp. Form.:
C29H52ClN7O8
Mol. Mass.:
662.218
SMILES:
Cl.CC[C@H](C)[C@H](NC(=O)[C@H](CCCCN)NC(C)=O)C(=O)N[C@@H]([C@@H](C)O)C(=O)N[C@@H](C)C(=O)N[C@@H](CC)C(=O)C(=O)NC1CC1
: