Target
Subtilisin-like protease 1
Ligand
BDBM50601901
Substrate
Meas. Tech.
ChEMBL_2238566 (CHEMBL5152462)
IC50
9300±n/a nM
Citation
 Lidumniece, EWithers-Martinez, CHackett, FBlackman, MJJirgensons, A Subtilisin-like Serine Protease 1 (SUB1) as an Emerging Antimalarial Drug Target: Current Achievements in Inhibitor Discovery. J Med Chem 65:12535-12545 (2022) Target
Name:
Subtilisin-like protease 1
Synonyms:
SUB1 Subtilisin-like protease sub-1
Type:
PROTEIN
Mol. Mass.:
77866.88
Organism:
Plasmodium falciparum
Description:
ChEMBL_830092
Residue:
690
  
Inhibitor
Name:
BDBM50601901
Synonyms:
CHEMBL5180525
Type:
Small organic molecule
Emp. Form.:
C17H31BN4O7
Mol. Mass.:
414.262
SMILES:
C[C@@H](O)[C@H](NC(=O)[C@@H](NC(C)=O)C1CCCC1)C(=O)NCC(=O)N[C@@H](C)B(O)O
: