Target
Subtilisin-like protease 1
Ligand
BDBM50045201
Substrate
Meas. Tech.
ChEMBL_2238568 (CHEMBL5152464)
IC50
600±n/a nM
Citation
 Lidumniece, EWithers-Martinez, CHackett, FBlackman, MJJirgensons, A Subtilisin-like Serine Protease 1 (SUB1) as an Emerging Antimalarial Drug Target: Current Achievements in Inhibitor Discovery. J Med Chem 65:12535-12545 (2022) Target
Name:
Subtilisin-like protease 1
Synonyms:
SUB1 Subtilisin-like protease sub-1
Type:
PROTEIN
Mol. Mass.:
77866.88
Organism:
Plasmodium falciparum
Description:
ChEMBL_830092
Residue:
690
  
Inhibitor
Name:
BDBM50045201
Synonyms:
CHEMBL3310822
Type:
Small organic molecule
Emp. Form.:
C22H35F2N5O9
Mol. Mass.:
551.5382
SMILES:
CC[C@H](C)[C@H](NC(C)=O)C(=O)N[C@@H]([C@@H](C)O)C(=O)N[C@@H](C)C(=O)N[C@@H](C)C(=O)C(F)(F)C(=O)NCC(O)=O
: