Target
Subtilisin-like protease 1
Ligand
BDBM50601909
Substrate
Meas. Tech.
ChEMBL_2238568 (CHEMBL5152464)
IC50
10000±n/a nM
Citation
 Lidumniece, EWithers-Martinez, CHackett, FBlackman, MJJirgensons, A Subtilisin-like Serine Protease 1 (SUB1) as an Emerging Antimalarial Drug Target: Current Achievements in Inhibitor Discovery. J Med Chem 65:12535-12545 (2022) Target
Name:
Subtilisin-like protease 1
Synonyms:
SUB1 Subtilisin-like protease sub-1
Type:
PROTEIN
Mol. Mass.:
77866.88
Organism:
Plasmodium falciparum
Description:
ChEMBL_830092
Residue:
690
  
Inhibitor
Name:
BDBM50601909
Synonyms:
CHEMBL537778 MMV007224 | TCMDC-125776
Type:
Small organic molecule
Emp. Form.:
C20H14Br2N4
Mol. Mass.:
470.16
SMILES:
Brc1ccc(Nc2nc3ccccc3nc2Nc2ccc(Br)cc2)cc1
: