Target
Subtilisin-like protease 1
Ligand
BDBM50601912
Substrate
Meas. Tech.
ChEMBL_2238568 (CHEMBL5152464)
IC50
11000±n/a nM
Citation
 Lidumniece, EWithers-Martinez, CHackett, FBlackman, MJJirgensons, A Subtilisin-like Serine Protease 1 (SUB1) as an Emerging Antimalarial Drug Target: Current Achievements in Inhibitor Discovery. J Med Chem 65:12535-12545 (2022) Target
Name:
Subtilisin-like protease 1
Synonyms:
SUB1 Subtilisin-like protease sub-1
Type:
PROTEIN
Mol. Mass.:
77866.88
Organism:
Plasmodium falciparum
Description:
ChEMBL_830092
Residue:
690
  
Inhibitor
Name:
BDBM50601912
Synonyms:
CHEMBL5204930
Type:
Small organic molecule
Emp. Form.:
C21H16Br2ClN5O2S
Mol. Mass.:
597.71
SMILES:
CS(=O)(=O)Nc1cc2nc(Nc3ccc(Br)cc3)c(Nc3ccc(Br)cc3)nc2cc1Cl
: