Target
Subtilisin-like protease 1
Ligand
BDBM50100887
Substrate
Meas. Tech.
ChEMBL_2238577 (CHEMBL5152473)
Ki
6000±n/a nM
Citation
 Lidumniece, EWithers-Martinez, CHackett, FBlackman, MJJirgensons, A Subtilisin-like Serine Protease 1 (SUB1) as an Emerging Antimalarial Drug Target: Current Achievements in Inhibitor Discovery. J Med Chem 65:12535-12545 (2022) Target
Name:
Subtilisin-like protease 1
Synonyms:
SUB1 Subtilisin-like protease sub-1
Type:
PROTEIN
Mol. Mass.:
77866.88
Organism:
Plasmodium falciparum
Description:
ChEMBL_830092
Residue:
690
  
Inhibitor
Name:
BDBM50100887
Synonyms:
CHEMBL3325857
Type:
Small organic molecule
Emp. Form.:
C26H22N4O2
Mol. Mass.:
422.4785
SMILES:
COc1ccc(Nc2cc(C)c3cc(NC(=O)c4cc5ccccc5[nH]4)ccc3n2)cc1
: