Target
Cholinesterase
Ligand
BDBM11022
Substrate
Meas. Tech.
ChEMBL_2238742 (CHEMBL5152638)
IC50
>1000000±n/a nM
Citation
 Reiland, KMEckroat, TJ Selective butyrylcholinesterase inhibition by isatin dimers and 3-indolyl-3-hydroxy-2-oxindole dimers. Bioorg Med Chem Lett 77:0 (2022) Target
Name:
Cholinesterase
Synonyms:
BCHE CHLE_HORSE | Cholinesterase
Type:
Enzyme
Mol. Mass.:
65643.35
Organism:
Equus caballus (Horse)
Description:
P81908
Residue:
574
  
Inhibitor
Name:
BDBM11022
Synonyms:
2,3-dihydro-1H-indole-2,3-dione Isatin | Isatin (Compound 1)
Type:
Small organic molecule
Emp. Form.:
C8H5NO2
Mol. Mass.:
147.1308
SMILES:
O=C1Nc2ccccc2C1=O
: