Target
Amine oxidase [flavin-containing] A
Ligand
BDBM11022
Substrate
Meas. Tech.
ChEMBL_2238747 (CHEMBL5152643)
IC50
8430±n/a nM
Citation
 Hitge, RPetzer, JPPetzer, A The inhibition of monoamine oxidase by 2H-1,4-benzothiazin-3(4H)-ones. Bioorg Med Chem Lett 77:0 (2022) Target
Name:
Amine oxidase [flavin-containing] A
Synonyms:
AOFA_HUMAN MAO-A Monoamine oxidase Monoamine oxidase type A (MAO A) Monoamine oxidase type A (MAOA)
Type:
Protein
Mol. Mass.:
59689.53
Organism:
Homo sapiens (Human)
Description:
P21397
Residue:
527
  
Inhibitor
Name:
BDBM11022
Synonyms:
2,3-dihydro-1H-indole-2,3-dione Isatin | Isatin (Compound 1)
Type:
Small organic molecule
Emp. Form.:
C8H5NO2
Mol. Mass.:
147.1308
SMILES:
O=C1Nc2ccccc2C1=O
: