Target
cGMP-dependent protein kinase
Ligand
BDBM50182363
Substrate
Meas. Tech.
ChEMBL_349021 (CHEMBL865064)
IC50
0.18±n/a nM
Citation
 Biftu, TFeng, DFisher, MLiang, GBQian, XScribner, ADennis, RLee, SLiberator, PABrown, CGurnett, ALeavitt, PSThompson, DMathew, JMisura, ASamaras, STamas, TSina, JFMcNulty, KAMcKnight, CGSchmatz, DMWyvratt, M Synthesis and SAR studies of very potent imidazopyridine antiprotozoal agents. Bioorg Med Chem Lett 16:2479-83 (2006)  
Target
Name:
cGMP-dependent protein kinase
Synonyms:
Type:
PROTEIN
Mol. Mass.:
112911.27
Organism:
Eimeria tenella
Description:
ChEMBL_469577
Residue:
1003
  
Inhibitor
Name:
BDBM50182363
Synonyms:
4-(7-(aminomethyl)-2-(4-fluorophenyl)H-imidazo[1,2-a]pyridin-3-yl)pyrimidin-2-amine | CHEMBL208365
Type:
Small organic molecule
Emp. Form.:
C18H15FN6
Mol. Mass.:
334.3503
SMILES:
NCc1ccn2c(c(nc2c1)-c1ccc(F)cc1)-c1ccnc(N)n1
: