Target
Potassium voltage-gated channel subfamily A member 3
Ligand
BDBM50182631
Substrate
Meas. Tech.
ChEMBL_334895 (CHEMBL861270)
EC50
600±n/a nM
Citation
 Harvey, AJBaell, JBToovey, NHomerick, DWulff, H A new class of blockers of the voltage-gated potassium channel Kv1.3 via modification of the 4- or 7-position of khellinone. J Med Chem 49:1433-41 (2006)  
Target
Name:
Potassium voltage-gated channel subfamily A member 3
Synonyms:
KCNA3_MOUSE MK3 Voltage-gated potassium channel subunit Kv1.3
Type:
PROTEIN
Mol. Mass.:
58553.58
Organism:
Mus musculus
Description:
ChEMBL_1513943
Residue:
528
  
Inhibitor
Name:
BDBM50182631
Synonyms:
1-(7-(4-(trifluoromethoxy)benzyloxy)-6-hydroxy-4-methoxybenzofuran-5-yl)ethanone | CHEMBL203541
Type:
Small organic molecule
Emp. Form.:
C19H15F3O6
Mol. Mass.:
396.314
SMILES:
COc1c(C(C)=O)c(O)c(OCc2ccc(OC(F)(F)F)cc2)c2occc12
: