Target
Transient receptor potential cation channel subfamily M member 5
Ligand
BDBM50602135
Substrate
Meas. Tech.
ChEMBL_2239339 (CHEMBL5153235)
EC50
631±n/a nM
Citation
 Sabat, MRaveglia, LFAldegheri, LBarilli, ABianchi, FBrault, LBrodbeck, DFeriani, ALingard, IMiura, JMyers, RPiccoli, LTassini, STyhonas, JTon-Nu, TWang, HVirginio, C The discovery of (1R, 3R)-1-(3-chloro-5-fluorophenyl)-3-(hydroxymethyl)-1,2,3,4-tetrahydroisoquinoline-6-carbonitrile, a potent and selective agonist of human transient receptor potential cation channel subfamily m member 5 (TRPM5) and evaluation of as a potential gastrointestinal prokinetic agent. Bioorg Med Chem 76:0 (2022) Target
Name:
Transient receptor potential cation channel subfamily M member 5
Synonyms:
LTRPC5 LTrpC-5 MLSN1- and TRP-related gene 1 protein TRPM5 Transient receptor potential cation channel subfamily M member 5
Type:
PROTEIN
Mol. Mass.:
131454.24
Organism:
Homo sapiens (Human)
Description:
ChEMBL_103787
Residue:
1165
  
Inhibitor
Name:
BDBM50602135
Synonyms:
CHEMBL5209032
Type:
Small organic molecule
Emp. Form.:
C12H13N3S2
Mol. Mass.:
263.382
SMILES:
Cn1c2ccccc2s\c1=N\C(=S)NCC=C
: