Target
Cytochrome P450 2D6
Ligand
BDBM50183231
Substrate
Meas. Tech.
ChEMBL_355283 (CHEMBL853204)
IC50
>5000±n/a nM
Citation
 Mulvihill, MJKan, JLCooke, ABhagwat, SBeck, PBittner, MCesario, CKeane, DLazarescu, VNigro, ANillson, CPanicker, BSmith, VSrebernak, MSun, FLO'Connor, MRusso, SFischetti, GVrkljan, MWinski, SCastelhano, ALEmerson, DGibson, NW 3-[6-(2-Dimethylamino-1-imidazol-1-yl-butyl)-naphthalen-2-yloxy]-2,2-dimethyl-propionic acid as a highly potent and selective retinoic acid metabolic blocking agent. Bioorg Med Chem Lett 16:2729-33 (2006)  
Target
Name:
Cytochrome P450 2D6
Synonyms:
CP2D6_HUMAN CYP2DL1 Cytochrome P450 2D6 (CYP2D6) P450-DB1
Type:
Protein
Mol. Mass.:
55774.82
Organism:
Homo sapiens (Human)
Description:
P10635
Residue:
497
  
Inhibitor
Name:
BDBM50183231
Synonyms:
1-((6-((1R,2R)-2-(ethyl(methyl)amino)-1-(1H-imidazol-1-yl)propyl)naphthalen-2-yloxy)methyl)cyclopentanecarboxylic acid | CHEMBL207942
Type:
Small organic molecule
Emp. Form.:
C26H33N3O3
Mol. Mass.:
435.5585
SMILES:
CCN(C)[C@H](C)[C@@H](c1ccc2cc(OCC3(CCCC3)C(O)=O)ccc2c1)n1ccnc1
: