Target
Alpha-1D adrenergic receptor
Ligand
BDBM50131402
Substrate
Meas. Tech.
ChEMBL_350832 (CHEMBL869686)
EC50
930±n/a nM
Citation
 del Olmo, EBarboza, BYbarra, MILópez-Pérez, JLCarrón, RSevilla, MABoselli, CSan Feliciano, A Vasorelaxant activity of phthalazinones and related compounds. Bioorg Med Chem Lett 16:2786-90 (2006)  
Target
Name:
Alpha-1D adrenergic receptor
Synonyms:
ADA1D_RAT Adra1d Alpha-1D adrenergic receptor | Serotonin 1a (5-HT1a) receptor/Adrenergic receptor alpha-1
Type:
Protein
Mol. Mass.:
59375.97
Organism:
Rattus norvegicus (Rat)
Description:
P23944
Residue:
561
  
Inhibitor
Name:
BDBM50131402
Synonyms:
4-(benzo[d][1,3]dioxol-5-ylmethyl)-2-methylphthalazin-1(2H)-one CHEMBL68362
Type:
Small organic molecule
Emp. Form.:
C17H14N2O3
Mol. Mass.:
294.3047
SMILES:
Cn1nc(Cc2ccc3OCOc3c2)c2ccccc2c1=O
: