Target
Alpha-1D adrenergic receptor
Ligand
BDBM50131404
Substrate
Meas. Tech.
ChEMBL_350832 (CHEMBL869686)
EC50
>10000±n/a nM
Citation
 del Olmo, EBarboza, BYbarra, MILópez-Pérez, JLCarrón, RSevilla, MABoselli, CSan Feliciano, A Vasorelaxant activity of phthalazinones and related compounds. Bioorg Med Chem Lett 16:2786-90 (2006)  
Target
Name:
Alpha-1D adrenergic receptor
Synonyms:
ADA1D_RAT Adra1d Alpha-1D adrenergic receptor | Serotonin 1a (5-HT1a) receptor/Adrenergic receptor alpha-1
Type:
Protein
Mol. Mass.:
59375.97
Organism:
Rattus norvegicus (Rat)
Description:
P23944
Residue:
561
  
Inhibitor
Name:
BDBM50131404
Synonyms:
4-(4-Methoxy-benzyl)-2H-phthalazin-1-one CHEMBL66432
Type:
Small organic molecule
Emp. Form.:
C16H14N2O2
Mol. Mass.:
266.2946
SMILES:
COc1ccc(Cc2n[nH]c(=O)c3ccccc23)cc1
: