Target
Alpha-1D adrenergic receptor
Ligand
BDBM50131420
Substrate
Meas. Tech.
ChEMBL_350832 (CHEMBL869686)
EC50
>100000±n/a nM
Citation
 del Olmo, EBarboza, BYbarra, MILópez-Pérez, JLCarrón, RSevilla, MABoselli, CSan Feliciano, A Vasorelaxant activity of phthalazinones and related compounds. Bioorg Med Chem Lett 16:2786-90 (2006)  
Target
Name:
Alpha-1D adrenergic receptor
Synonyms:
ADA1D_RAT Adra1d Alpha-1D adrenergic receptor | Serotonin 1a (5-HT1a) receptor/Adrenergic receptor alpha-1
Type:
Protein
Mol. Mass.:
59375.97
Organism:
Rattus norvegicus (Rat)
Description:
P23944
Residue:
561
  
Inhibitor
Name:
BDBM50131420
Synonyms:
4-(3,4,5-Trimethoxy-benzyl)-2H-phthalazin-1-one CHEMBL307117
Type:
Small organic molecule
Emp. Form.:
C18H18N2O4
Mol. Mass.:
326.3465
SMILES:
COc1cc(Cc2n[nH]c(=O)c3ccccc23)cc(OC)c1OC
: