Target
Alpha-1D adrenergic receptor
Ligand
BDBM50183679
Substrate
Meas. Tech.
ChEMBL_350832 (CHEMBL869686)
EC50
9800±n/a nM
Citation
 del Olmo, EBarboza, BYbarra, MILópez-Pérez, JLCarrón, RSevilla, MABoselli, CSan Feliciano, A Vasorelaxant activity of phthalazinones and related compounds. Bioorg Med Chem Lett 16:2786-90 (2006)  
Target
Name:
Alpha-1D adrenergic receptor
Synonyms:
ADA1D_RAT Adra1d Alpha-1D adrenergic receptor | Serotonin 1a (5-HT1a) receptor/Adrenergic receptor alpha-1
Type:
Protein
Mol. Mass.:
59375.97
Organism:
Rattus norvegicus (Rat)
Description:
P23944
Residue:
561
  
Inhibitor
Name:
BDBM50183679
Synonyms:
4-(3,4-dimethoxybenzyl)-2-allylphthalazin-1(2H)-one | CHEMBL207170
Type:
Small organic molecule
Emp. Form.:
C20H20N2O3
Mol. Mass.:
336.3844
SMILES:
COc1ccc(Cc2nn(CC=C)c(=O)c3ccccc23)cc1OC
: