Target
Alpha-1A adrenergic receptor
Ligand
BDBM50131423
Substrate
Meas. Tech.
ChEMBL_350835 (CHEMBL869689)
EC50
1500±n/a nM
Citation
 del Olmo, EBarboza, BYbarra, MILópez-Pérez, JLCarrón, RSevilla, MABoselli, CSan Feliciano, A Vasorelaxant activity of phthalazinones and related compounds. Bioorg Med Chem Lett 16:2786-90 (2006)  
Target
Name:
Alpha-1A adrenergic receptor
Synonyms:
ADA1A_RAT Adra1c Alpha-1A adrenoceptor Alpha-1C adrenergic receptor | adrenergic Alpha1A
Type:
Protein
Mol. Mass.:
51620.15
Organism:
Rattus norvegicus (Rat)
Description:
P43140
Residue:
466
  
Inhibitor
Name:
BDBM50131423
Synonyms:
4-Benzyl-2-methyl-2H-phthalazin-1-one CHEMBL304747
Type:
Small organic molecule
Emp. Form.:
C16H14N2O
Mol. Mass.:
250.2952
SMILES:
Cn1nc(Cc2ccccc2)c2ccccc2c1=O
: