Target
Alpha-1D adrenergic receptor
Ligand
BDBM50183688
Substrate
Meas. Tech.
ChEMBL_350832 (CHEMBL869686)
EC50
>100000±n/a nM
Citation
 del Olmo, EBarboza, BYbarra, MILópez-Pérez, JLCarrón, RSevilla, MABoselli, CSan Feliciano, A Vasorelaxant activity of phthalazinones and related compounds. Bioorg Med Chem Lett 16:2786-90 (2006)  
Target
Name:
Alpha-1D adrenergic receptor
Synonyms:
ADA1D_RAT Adra1d Alpha-1D adrenergic receptor | Serotonin 1a (5-HT1a) receptor/Adrenergic receptor alpha-1
Type:
Protein
Mol. Mass.:
59375.97
Organism:
Rattus norvegicus (Rat)
Description:
P23944
Residue:
561
  
Inhibitor
Name:
BDBM50183688
Synonyms:
4-(4-(methylthio)benzyl)-2-(4-bromophenyl)phthalazin-1(2H)-one | CHEMBL380512
Type:
Small organic molecule
Emp. Form.:
C22H17BrN2OS
Mol. Mass.:
437.352
SMILES:
CSc1ccc(Cc2nn(-c3ccc(Br)cc3)c(=O)c3ccccc23)cc1
: