Target
Matrix metalloproteinase-16
Ligand
BDBM50183711
Substrate
Meas. Tech.
ChEMBL_354474 (CHEMBL853109)
Ki
>5554±n/a nM
Citation
 Gilmore, JLKing, BWHarris, CMaduskuie, TMercer, SELiu, RQCovington, MBQian, MRibadeneria, MDVaddi, KTrzaskos, JMNewton, RCDecicco, CPDuan, JJ Synthesis and structure-activity relationship of a novel, achiral series of TNF-alpha converting enzyme inhibitors. Bioorg Med Chem Lett 16:2699-704 (2006)  
Target
Name:
Matrix metalloproteinase-16
Synonyms:
C8orf57 MMP-X2 MMP16_HUMAN MT-MMP 3 MT3MMP Matrix metalloproteinase 16 Membrane-type matrix metalloproteinase 3 | Membrane-type-3 matrix metalloproteinase
Type:
PROTEIN
Mol. Mass.:
69536.76
Organism:
Homo sapiens (Human)
Description:
ChEMBL_799129
Residue:
607
  
Inhibitor
Name:
BDBM50183711
Synonyms:
CHEMBL208009 | N-(4-(2-(hydroxyamino)-2-oxoethyl)piperidin-4-yl)-4-((2-methylquinolin-4-yl)methoxy)benzamide
Type:
Small organic molecule
Emp. Form.:
C25H28N4O4
Mol. Mass.:
448.5142
SMILES:
Cc1cc(COc2ccc(cc2)C(=O)NC2(CC(=O)NO)CCNCC2)c2ccccc2n1
: