Target
72 kDa type IV collagenase
Ligand
BDBM50183730
Substrate
Meas. Tech.
ChEMBL_354460 (CHEMBL870685)
Ki
>3333±n/a nM
Citation
 Gilmore, JLKing, BWHarris, CMaduskuie, TMercer, SELiu, RQCovington, MBQian, MRibadeneria, MDVaddi, KTrzaskos, JMNewton, RCDecicco, CPDuan, JJ Synthesis and structure-activity relationship of a novel, achiral series of TNF-alpha converting enzyme inhibitors. Bioorg Med Chem Lett 16:2699-704 (2006)  
Target
Name:
72 kDa type IV collagenase
Synonyms:
72 kDa gelatinase CLG4A Gelatinase A (MMP-2) MMP2_HUMAN Matrix metalloproteinase-2 (MMP 2) Matrix metalloproteinases 2 (MMP-2) | TBE-1
Type:
Enzyme
Mol. Mass.:
73870.36
Organism:
Homo sapiens (Human)
Description:
P08253
Residue:
660
  
Inhibitor
Name:
BDBM50183730
Synonyms:
CHEMBL380895 | N-(4-(2-(hydroxyamino)-2-oxoethyl)-1-methylpiperidin-4-yl)-4-((2-methylquinolin-4-yl)methoxy)benzamide
Type:
Small organic molecule
Emp. Form.:
C26H30N4O4
Mol. Mass.:
462.5408
SMILES:
CN1CCC(CC(=O)NO)(CC1)NC(=O)c1ccc(OCc2cc(C)nc3ccccc23)cc1
: