Target
Disintegrin and metalloproteinase domain-containing protein 17
Ligand
BDBM50183730
Substrate
Meas. Tech.
ChEMBL_354454 (CHEMBL865120)
IC50
109±n/a nM
Citation
 Gilmore, JLKing, BWHarris, CMaduskuie, TMercer, SELiu, RQCovington, MBQian, MRibadeneria, MDVaddi, KTrzaskos, JMNewton, RCDecicco, CPDuan, JJ Synthesis and structure-activity relationship of a novel, achiral series of TNF-alpha converting enzyme inhibitors. Bioorg Med Chem Lett 16:2699-704 (2006)  
Target
Name:
Disintegrin and metalloproteinase domain-containing protein 17
Synonyms:
ADA17_HUMAN CSVP Disintegrin and metalloproteinase domain-containing protein 17 (ADAM17) TNF-alpha convertase TNF-alpha-converting enzyme (TACE) Tumor necrosis factor-α converting enzyme (TACE)
Type:
Enzyme
Mol. Mass.:
93007.89
Organism:
Homo sapiens (Human)
Description:
Residue:
824
  
Inhibitor
Name:
BDBM50183730
Synonyms:
CHEMBL380895 | N-(4-(2-(hydroxyamino)-2-oxoethyl)-1-methylpiperidin-4-yl)-4-((2-methylquinolin-4-yl)methoxy)benzamide
Type:
Small organic molecule
Emp. Form.:
C26H30N4O4
Mol. Mass.:
462.5408
SMILES:
CN1CCC(CC(=O)NO)(CC1)NC(=O)c1ccc(OCc2cc(C)nc3ccccc23)cc1
: