Target
cAMP-dependent protein kinase catalytic subunit alpha/beta/gamma
Ligand
BDBM50183841
Substrate
Meas. Tech.
ChEMBL_354919 (CHEMBL870111)
IC50
>10000±n/a nM
Citation
 Hennequin, LFBallard, PBoyle, FTDelouvrié, BEllston, RPHalsall, CTHarris, CSHudson, KKendrew, JPease, JERoss, HSSmith, PVincent, JL Novel 4-anilinoquinazolines with C-6 carbon-linked side chains: synthesis and structure-activity relationship of a series of potent, orally active, EGF receptor tyrosine kinase inhibitors. Bioorg Med Chem Lett 16:2672-6 (2006)  
Target
Name:
cAMP-dependent protein kinase catalytic subunit alpha/beta/gamma
Synonyms:
cAMP-dependent protein kinase (PKA)
Type:
Mol. Mass.:
Description:
ASSAY_ID of ChEMBL is 217489
Components:
This complex has 3 components.
Component 1
Name:
cAMP-dependent protein kinase catalytic subunit beta
Synonyms:
KAPCB_HUMAN PKAC-beta cAMP-dependent protein kinase (PKA) cAMP-dependent protein kinase catalytic subunit beta
Type:
PROTEIN
Mol. Mass.:
40631.25
Organism:
Homo sapiens (Human)
Description:
ChEMBL_586348
Residue:
351
  
Component 2
Name:
cAMP-dependent protein kinase catalytic subunit alpha
Synonyms:
KAPCA_HUMAN PKACA cAMP-dependent protein kinase (PKA) cAMP-dependent protein kinase catalytic subunit alpha cAMP-dependent protein kinase catalytic subunit alpha (PKACA) cAMP-dependent protein kinase catalytic subunit alpha isoform 1 | cAMP-dependent protein kinase, alpha-catalytic subunit
Type:
Enzyme Catalytic Subunit
Mol. Mass.:
40598.73
Organism:
Homo sapiens (Human)
Description:
Residue:
351
  
Component 3
Name:
cAMP-dependent protein kinase catalytic subunit gamma
Synonyms:
KAPCG_HUMAN PRKACG cAMP-dependent protein kinase catalytic subunit gamma
Type:
PROTEIN
Mol. Mass.:
40442.03
Organism:
Homo sapiens (Human)
Description:
ChEMBL_104720
Residue:
351
  
Inhibitor
Name:
BDBM50183841
Synonyms:
3-(((4-(3-chloro-2-fluorophenylamino)-7-methoxyquinazolin-6-yl)methyl)(methyl)amino)pyrrolidin-2-one | CHEMBL378370
Type:
Small organic molecule
Emp. Form.:
C21H21ClFN5O2
Mol. Mass.:
429.875
SMILES:
COc1cc2ncnc(Nc3cccc(Cl)c3F)c2cc1CN(C)C1CCNC1=O
: