Target
Tyrosine-protein kinase Lck
Ligand
BDBM50183841
Substrate
Meas. Tech.
ChEMBL_354930 (CHEMBL870121)
IC50
>10000±n/a nM
Citation
 Hennequin, LFBallard, PBoyle, FTDelouvrié, BEllston, RPHalsall, CTHarris, CSHudson, KKendrew, JPease, JERoss, HSSmith, PVincent, JL Novel 4-anilinoquinazolines with C-6 carbon-linked side chains: synthesis and structure-activity relationship of a series of potent, orally active, EGF receptor tyrosine kinase inhibitors. Bioorg Med Chem Lett 16:2672-6 (2006)  
Target
Name:
Tyrosine-protein kinase Lck
Synonyms:
2.7.10.2 LCK_HUMAN Leukocyte C-terminal Src kinase Lymphocyte-specific protein tyrosine kinase Protein YT16 Proto-oncogene tyrosine-protein kinase LCK T cell-specific protein-tyrosine kinase
Type:
Mol. Mass.:
57987.83
Organism:
Homo sapiens (Human)
Description:
P06239
Residue:
509
  
Inhibitor
Name:
BDBM50183841
Synonyms:
3-(((4-(3-chloro-2-fluorophenylamino)-7-methoxyquinazolin-6-yl)methyl)(methyl)amino)pyrrolidin-2-one | CHEMBL378370
Type:
Small organic molecule
Emp. Form.:
C21H21ClFN5O2
Mol. Mass.:
429.875
SMILES:
COc1cc2ncnc(Nc3cccc(Cl)c3F)c2cc1CN(C)C1CCNC1=O
: