Target
Tyrosine-protein kinase Fyn
Ligand
BDBM13216
Substrate
Meas. Tech.
ChEMBL_2242299 (CHEMBL5156509)
IC50
2.7±n/a nM
Citation
 Demuro, SSauvey, CTripathi, SKDi Martino, RMCShi, DOrtega, JARusso, DBalboni, BGiabbai, BStorici, PGirotto, SAbagyan, RCavalli, A ARN25068, a versatile starting point towards triple GSK-3?/FYN/DYRK1A inhibitors to tackle tau-related neurological disorders. Eur J Med Chem 229:0 (2022) Target
Name:
Tyrosine-protein kinase Fyn
Synonyms:
FYN Proto-oncogene Syn SLK Src-like kinase | p59-Fyn
Type:
Enzyme
Mol. Mass.:
60762.21
Organism:
Homo sapiens (Human)
Description:
P06241
Residue:
537
  
Inhibitor
Name:
BDBM13216
Synonyms:
BMS-354825 DASATINIB N-(2-chloro-6-methylphenyl)-2-({6-[4-(2-hydroxyethyl)piperazin-1-yl]-2-methylpyrimidin-4-yl}amino)-1,3-thiazole-5-carboxamide US20230348453, Compound A8 med.21724, Compound Dasatinib
Type:
Small organic molecule
Emp. Form.:
C22H26ClN7O2S
Mol. Mass.:
488.006
SMILES:
Cc1nc(Nc2ncc(s2)C(=O)Nc2c(C)cccc2Cl)cc(n1)N1CCN(CCO)CC1
: