Target
Thromboxane A2 receptor
Ligand
BDBM50184240
Substrate
Meas. Tech.
ChEMBL_364758 (CHEMBL871220)
Ki
3600±n/a nM
Citation
 Sturino, CFLachance, NBoyd, MBerthelette, CLabelle, MLi, LRoy, BScheigetz, JTsou, NBrideau, CCauchon, ECarriere, MCDenis, DGreig, GKargman, SLamontagne, SMathieu, MCSawyer, NSlipetz, DO'Neill, GWang, ZZamboni, RMetters, KMYoung, RN Identification of an indole series of prostaglandin D2 receptor antagonists. Bioorg Med Chem Lett 16:3043-8 (2006)  
Target
Name:
Thromboxane A2 receptor
Synonyms:
Prostanoid TP receptor TBXA2R Thromboxane Thromboxane Beta
Type:
Enyzme
Mol. Mass.:
37445.28
Organism:
Homo sapiens (Human)
Description:
P21731
Residue:
343
  
Inhibitor
Name:
BDBM50184240
Synonyms:
2-(4-(4-chlorobenzyl)-5-acetyl-7-(methylsulfonyl)-1,2,3,4-tetrahydrocyclopenta[b]indol-3-yl)acetic acid | CHEMBL379711
Type:
Small organic molecule
Emp. Form.:
C23H22ClNO5S
Mol. Mass.:
459.942
SMILES:
CC(=O)c1cc(cc2c3CCC(CC(O)=O)c3n(Cc3ccc(Cl)cc3)c12)S(C)(=O)=O
: