Target
Peroxisome proliferator-activated receptor alpha
Ligand
BDBM50184249
Substrate
Meas. Tech.
ChEMBL_364828 (CHEMBL870175)
IC50
450±n/a nM
Citation
 Szewczyk, JWHuang, SChin, JTian, JMitnaul, LRosa, RLPeterson, LSparrow, CPAdams, AD SAR studies: designing potent and selective LXR agonists. Bioorg Med Chem Lett 16:3055-60 (2006)  
Target
Name:
Peroxisome proliferator-activated receptor alpha
Synonyms:
NR1C1 PPAR PPAR-alpha PPARA_HUMAN Peroxisome proliferator-activated receptor | Peroxisome proliferator-activated receptor alpha (PPAR alpha)
Type:
Enzyme
Mol. Mass.:
52222.08
Organism:
Homo sapiens (Human)
Description:
Q07869
Residue:
468
  
Inhibitor
Name:
BDBM50184249
Synonyms:
3-(1-(3-(7-propyl-3-(trifluoromethyl)benzo[d]isoxazol-6-yloxy)propyl)-1H-indol-5-yl)propanoic acid | CHEMBL207907
Type:
Small organic molecule
Emp. Form.:
C25H25F3N2O4
Mol. Mass.:
474.4722
SMILES:
CCCc1c(OCCCn2ccc3cc(CCC(O)=O)ccc23)ccc2c(noc12)C(F)(F)F
: