Target
5-hydroxytryptamine receptor 1A
Ligand
BDBM50184575
Substrate
Meas. Tech.
ChEMBL_353648 (CHEMBL866225)
Ki
722±n/a nM
Citation
 Strappaghetti, GBrodi, CGiannaccini, GBetti, L New 4-(4-methyl-phenyl)phthalazin-1(2H)-one derivatives and their effects on alpha1-receptors. Bioorg Med Chem Lett 16:2575-9 (2006)  
Target
Name:
5-hydroxytryptamine receptor 1A
Synonyms:
5-HT-1A 5-HT1A 5-hydroxytryptamine receptor 1A (5HT1A) 5ht1a Htr1a Serotonin 1a (5-HT1a) receptor/Adrenergic receptor alpha-1 | Serotonin receptor 1A
Type:
G Protein-Coupled Receptor (GPCR)
Mol. Mass.:
46445.29
Organism:
Rattus norvegicus (rat)
Description:
Binding assays were performed using rat hippocampal membranes.
Residue:
422
  
Inhibitor
Name:
BDBM50184575
Synonyms:
4-p-tolyl-2-(7-(4-(3-(trifluoromethyl)phenyl)piperazin-1-yl)heptyl)phthalazin-1(2H)-one | CHEMBL555836
Type:
Small organic molecule
Emp. Form.:
C33H37F3N4O
Mol. Mass.:
562.6683
SMILES:
Cc1ccc(cc1)-c1nn(CCCCCCCN2CCN(CC2)c2cccc(c2)C(F)(F)F)c(=O)c2ccccc12
: