Target
5-hydroxytryptamine receptor 1A
Ligand
BDBM50184577
Substrate
Meas. Tech.
ChEMBL_353648 (CHEMBL866225)
Ki
1928±n/a nM
Citation
 Strappaghetti, GBrodi, CGiannaccini, GBetti, L New 4-(4-methyl-phenyl)phthalazin-1(2H)-one derivatives and their effects on alpha1-receptors. Bioorg Med Chem Lett 16:2575-9 (2006)  
Target
Name:
5-hydroxytryptamine receptor 1A
Synonyms:
5-HT-1A 5-HT1A 5-hydroxytryptamine receptor 1A (5HT1A) 5ht1a Htr1a Serotonin 1a (5-HT1a) receptor/Adrenergic receptor alpha-1 | Serotonin receptor 1A
Type:
G Protein-Coupled Receptor (GPCR)
Mol. Mass.:
46445.29
Organism:
Rattus norvegicus (rat)
Description:
Binding assays were performed using rat hippocampal membranes.
Residue:
422
  
Inhibitor
Name:
BDBM50184577
Synonyms:
2-(4-(4-((2,3-dihydrobenzo[b][1,4]dioxin-2-yl)methyl)piperazin-1-yl)butyl)-4-p-tolylphthalazin-1(2H)-one | CHEMBL208517
Type:
Small organic molecule
Emp. Form.:
C32H36N4O3
Mol. Mass.:
524.6532
SMILES:
Cc1ccc(cc1)-c1nn(CCCCN2CCN(CC3COc4ccccc4O3)CC2)c(=O)c2ccccc12
: