Target
5-hydroxytryptamine receptor 1A
Ligand
BDBM50184583
Substrate
Meas. Tech.
ChEMBL_353648 (CHEMBL866225)
Ki
207±n/a nM
Citation
 Strappaghetti, GBrodi, CGiannaccini, GBetti, L New 4-(4-methyl-phenyl)phthalazin-1(2H)-one derivatives and their effects on alpha1-receptors. Bioorg Med Chem Lett 16:2575-9 (2006)  
Target
Name:
5-hydroxytryptamine receptor 1A
Synonyms:
5-HT-1A 5-HT1A 5-hydroxytryptamine receptor 1A (5HT1A) 5ht1a Htr1a Serotonin 1a (5-HT1a) receptor/Adrenergic receptor alpha-1 | Serotonin receptor 1A
Type:
G Protein-Coupled Receptor (GPCR)
Mol. Mass.:
46445.29
Organism:
Rattus norvegicus (rat)
Description:
Binding assays were performed using rat hippocampal membranes.
Residue:
422
  
Inhibitor
Name:
BDBM50184583
Synonyms:
2-(7-(4-(2-ethoxyphenyl)piperazin-1-yl)heptyl)-4-p-tolylphthalazin-1(2H)-one | CHEMBL207893
Type:
Small organic molecule
Emp. Form.:
C34H42N4O2
Mol. Mass.:
538.7229
SMILES:
CCOc1ccccc1N1CCN(CCCCCCCn2nc(-c3ccc(C)cc3)c3ccccc3c2=O)CC1
: