Target
5-hydroxytryptamine receptor 1A
Ligand
BDBM50184574
Substrate
Meas. Tech.
ChEMBL_353648 (CHEMBL866225)
Ki
450±n/a nM
Citation
 Strappaghetti, GBrodi, CGiannaccini, GBetti, L New 4-(4-methyl-phenyl)phthalazin-1(2H)-one derivatives and their effects on alpha1-receptors. Bioorg Med Chem Lett 16:2575-9 (2006)  
Target
Name:
5-hydroxytryptamine receptor 1A
Synonyms:
5-HT-1A 5-HT1A 5-hydroxytryptamine receptor 1A (5HT1A) 5ht1a Htr1a Serotonin 1a (5-HT1a) receptor/Adrenergic receptor alpha-1 | Serotonin receptor 1A
Type:
G Protein-Coupled Receptor (GPCR)
Mol. Mass.:
46445.29
Organism:
Rattus norvegicus (rat)
Description:
Binding assays were performed using rat hippocampal membranes.
Residue:
422
  
Inhibitor
Name:
BDBM50184574
Synonyms:
2-(4-(4-phenylpiperazin-1-yl)butyl)-4-p-tolylphthalazin-1(2H)-one | CHEMBL207573
Type:
Small organic molecule
Emp. Form.:
C29H32N4O
Mol. Mass.:
452.5906
SMILES:
Cc1ccc(cc1)-c1nn(CCCCN2CCN(CC2)c2ccccc2)c(=O)c2ccccc12
: