Target
Cathepsin D
Ligand
BDBM50400214
Substrate
Meas. Tech.
ChEMBL_2244256 (CHEMBL5158466)
IC50
0.078300±n/a nM
Citation
 Li, ZLi, HJiang, FWang, ZZhang, W Cathepsin D inhibitors based on tasiamide B derivatives with cell membrane permeability. Bioorg Med Chem 57:0 (2022) Target
Name:
Cathepsin D
Synonyms:
CATD_HUMAN CTSD Cathepsin D heavy chain Cathepsin D precursor
Type:
Enzyme
Mol. Mass.:
44551.72
Organism:
Homo sapiens (Human)
Description:
Human proCathepsin D (SwissProt accession number P07339) was expressed in Sf9 cells, purified, and autoactivated.
Residue:
412
  
Inhibitor
Name:
BDBM50400214
Synonyms:
CHEMBL2181022
Type:
Small organic molecule
Emp. Form.:
C55H76N8O12
Mol. Mass.:
1041.2383
SMILES:
COC(=O)[C@@H]1CCCN1C(=O)[C@@H](Cc1ccccc1)N(C)C(=O)[C@H](C)NC(=O)[C@H](CC(C)C)NC(=O)C[C@H](O)[C@H](Cc1ccccc1)NC(=O)[C@H](CCC(N)=O)N(C)C(=O)[C@@H](NC(=O)OCc1ccccc1)C(C)C
: