Target
Potassium voltage-gated channel subfamily H member 2
Ligand
BDBM50184809
Substrate
Meas. Tech.
ChEMBL_342119 (CHEMBL859790)
IC50
20000±n/a nM
Citation
 Bhide, RSCai, ZWZhang, YZQian, LWei, DBarbosa, SLombardo, LJBorzilleri, RMZheng, XWu, LIBarrish, JCKim, SHLeavitt, KMathur, ALeith, LChao, SWautlet, BMortillo, SJeyaseelan, RKukral, DHunt, JTKamath, AFura, AVyas, VMarathe, PD'Arienzo, CDerbin, GFargnoli, J Discovery and preclinical studies of (R)-1-(4-(4-fluoro-2-methyl-1H-indol-5-yloxy)-5- methylpyrrolo[2,1-f][1,2,4]triazin-6-yloxy)propan- 2-ol (BMS-540215), an in vivo active potent VEGFR-2 inhibitor. J Med Chem 49:2143-6 (2006)  
Target
Name:
Potassium voltage-gated channel subfamily H member 2
Synonyms:
1,3-beta-glucan synthase component GLS2 ERG Eag-related protein 1 Ether-a-go-go-related gene (HERG) Ether-a-go-go-related gene potassium channel 1 Ether-a-go-go-related gene potassium channel 1 (hERG1) Ether-a-go-go-related protein 1 H-ERG KCNH2 Potassium voltage-gated channel subfamily H member 2 (hERG) Voltage-gated potassium channel subunit Kv11.1 hERG Potassium Channel 1 | putative potassium channel subunit
Type:
Multi-pass membrane protein
Mol. Mass.:
126672.65
Organism:
Homo sapiens (Human)
Description:
Q12809
Residue:
1159
  
Inhibitor
Name:
BDBM50184809
Synonyms:
4-(4-fluoro-2-methyl-1H-indol-5-yloxy)-5-methyl-6-(3-(methylsulfonyl)propoxy)pyrrolo[2,1-f][1,2,4]triazine | CHEMBL383077
Type:
Small organic molecule
Emp. Form.:
C20H21FN4O4S
Mol. Mass.:
432.469
SMILES:
Cc1cc2c(F)c(Oc3ncnn4cc(OCCCS(C)(=O)=O)c(C)c34)ccc2[nH]1
: