Target
Vascular endothelial growth factor receptor 2
Ligand
BDBM50184812
Substrate
Meas. Tech.
ChEMBL_342115 (CHEMBL860941)
IC50
20±n/a nM
Citation
 Bhide, RSCai, ZWZhang, YZQian, LWei, DBarbosa, SLombardo, LJBorzilleri, RMZheng, XWu, LIBarrish, JCKim, SHLeavitt, KMathur, ALeith, LChao, SWautlet, BMortillo, SJeyaseelan, RKukral, DHunt, JTKamath, AFura, AVyas, VMarathe, PD'Arienzo, CDerbin, GFargnoli, J Discovery and preclinical studies of (R)-1-(4-(4-fluoro-2-methyl-1H-indol-5-yloxy)-5- methylpyrrolo[2,1-f][1,2,4]triazin-6-yloxy)propan- 2-ol (BMS-540215), an in vivo active potent VEGFR-2 inhibitor. J Med Chem 49:2143-6 (2006)  
Target
Name:
Vascular endothelial growth factor receptor 2
Synonyms:
CD_antigen=CD309 Fetal liver kinase 1 (FLK-1) KDR Protein-tyrosine kinase receptor Flk-1 VEGFR-2 VEGFR2 Vascular Endothelial Growth Factor Receptor Kinase 2 Vascular endothelial growth factor receptor 2 (KDR) Vascular endothelial growth factor receptor 2 (VEGFR2) Vascular endothelial growth factor receptor-2 (VEGFR-2)
Type:
Receptor Tyrosine Kinase
Mol. Mass.:
151510.97
Organism:
Homo sapiens (Human)
Description:
P35968
Residue:
1356
  
Inhibitor
Name:
BDBM50184812
Synonyms:
4-(4-fluoro-2-methyl-1H-indol-5-yloxy)-5-methyl-6-(2-(1-methylpiperidin-4-yl)ethoxy)pyrrolo[1,2-f][1,2,4]triazine | CHEMBL206145
Type:
Small organic molecule
Emp. Form.:
C24H28FN5O2
Mol. Mass.:
437.5098
SMILES:
CN1CCC(CCOc2cn3ncnc(Oc4ccc5[nH]c(C)cc5c4F)c3c2C)CC1
: