Target
Protein-glutamine gamma-glutamyltransferase 2
Ligand
BDBM50603640
Substrate
Meas. Tech.
ChEMBL_2244720 (CHEMBL5158930)
Ki
2800±n/a nM
Citation
 McNeil, NMRGates, EWJFiroozi, NCundy, NJLeccese, JEisinga, STyndall, JDAAdhikary, GEckert, RLKeillor, JW Structure-activity relationships of N-terminal variants of peptidomimetic tissue transglutaminase inhibitors. Eur J Med Chem 232:0 (2022) Target
Name:
Protein-glutamine gamma-glutamyltransferase 2
Synonyms:
Protein-glutamine gamma-glutamyltransferase TGM2 Tissue transglutaminase Transglutaminase 2 (TGM2) Transglutaminase-2
Type:
Protein
Mol. Mass.:
77309.30
Organism:
Homo sapiens (Human)
Description:
P21980
Residue:
687
  
Inhibitor
Name:
BDBM50603640
Synonyms:
CHEMBL5171518
Type:
Small organic molecule
Emp. Form.:
C33H38N4O4
Mol. Mass.:
554.6792
SMILES:
C=CC(=O)NCCCC[C@H](NC(=O)CCc1ccccc1)C(=O)N1CCN(CC1)C(=O)c1cccc2ccccc12
: