Target
Aurora kinase A
Ligand
BDBM26326
Substrate
Meas. Tech.
ChEMBL_2244801 (CHEMBL5159011)
IC50
9.0±n/a nM
Citation
 Bijian, KWernic, DNivedha, AKSu, JLim, FPLMiron, CEAmzil, HMoitessier, NAlaoui-Jamali, MA Novel Aurora A and Protein Kinase C (?, ?1, ?2, and ?) Multitarget Inhibitors: Impact of Selenium Atoms on the Potency and Selectivity. J Med Chem 65:3134-3150 (2022) Target
Name:
Aurora kinase A
Synonyms:
AIK ARK-1 AURA AURKA_HUMAN Aurora 2 Aurora kinase A (AURKA) Aurora kinase A (Aurora-2) Aurora/IPL1-related kinase 1 Breast tumor-amplified kinase IAK1 STK15 GN Serine/threonine kinase 15 Serine/threonine-protein kinase 6 Serine/threonine-protein kinase aurora-A aurora-2 | hARK1
Type:
Serine/threonine-protein kinase
Mol. Mass.:
45830.98
Organism:
Homo sapiens (Human)
Description:
O14965
Residue:
403
  
Inhibitor
Name:
BDBM26326
Synonyms:
1-(3-chlorophenyl)-3-[5-(2-{thieno[3,2-d]pyrimidin-4-ylamino}ethyl)-1,3-thiazol-2-yl]urea | SN-314
Type:
Small organic molecule
Emp. Form.:
C18H15ClN6OS2
Mol. Mass.:
430.934
SMILES:
Clc1cccc(NC(=O)Nc2ncc(CCNc3ncnc4ccsc34)s2)c1
: